{"text_format":"1","workbook":"xlsx","n_sheets":8,"sheets":["Instructions","Card List","Individual Order Form","Monthly Sales","Monthly Orders","Monthly Inventory","Formulas","Sheet3"],"not_rendered":{"charts":0,"images":0,"macros":1,"external_links":0,"defined_names":2,"comments":0,"pivot_tables":0},"unopened":[],"bounds":{"document_bytes":16777216,"sheet_cells":100000,"rows_first":2000,"rows_last":500,"rows_between":2000,"halvings":0,"cell_chars":16384,"cell_head_chars":4096},"cells_cut":0,"cells_raw":0,"read":"whole","date_system":"1900"}

{"sheet":"Instructions","index":0,"n_rows":100,"n_cols":4,"rows_kept":100,"cut":false,"hidden":false,"merged":[[24,3,24,16],[25,3,25,17],[26,3,26,17],[0,0,0,8],[18,3,18,16],[21,3,21,17],[22,3,22,17],[19,3,19,17],[20,3,20,17]]}
["File Instructions"]
["GENERAL:"]
["1)","Use a new File for each month.  Keep the \"Blank\" file so you can copy and use each month."]
[]
["2)","Save files by month and year date.  For example:  Scrip_March2023"]
[]
[]
[null,"Monthly Sales:",null,"This form is to record each week of sales for the month."]
[null,null,null,"It must tie to the deposit (see form)."]
[null,null,null,"In addition, the form tracks all IOUs and the IOU balances."]
[]
[null,"Monthly Orders:",null,"This sheet is to track the monthly cards ordered and costs."]
[null,null,null,"Each order should tie to the order form from the scrip company."]
[]
[null,"Monthly Inventory:",null,"This sheet is to tracks the iventory of cards on hand."]
[]
["INSTRUCTIONS FOR EACH FORM:"]
[]
["Individual Order Form:"]
[null,null,"*","This form can be printed for the customers to use for their orders."]
{"$rows_left_out":81}
{"sheet":"Card List","index":1,"n_rows":95,"n_cols":4,"rows_kept":95,"cut":false,"hidden":false,"merged":[]}
[null,"Retailer","Card Amt.","Profit %"]
[1,"Amazon",25,2.2499999999999999E-2]
[]
[0,"American Eagle",25,0.1]
[0,"Apple iTunes",15,0.05]
[0,"Applebee's",25,0.08]
[1,"Arby's",10,0.08]
[1,"Barnes & Noble",10,0.08]
[1,"Bath & Body Works",10,0.13]
[0,"Bed Bath & Beyond",25,7.0000000000000007E-2]
[0,"Best Buy",25,0.04]
[1,"BP Oil/Amoco",50,1.4999999999999999E-2]
[0,"Buffalo Wild Wings",25,0.08]
[0,"Burger King",10,0.04]
[0,"Cheddars",25,0.08]
[0,"Cheesecake Factory",25,0.05]
[0,"Chili's/Maggiano's",25,0.11]
[1,"Chipotle",10,0.1]
[1,"Cousin's",10,0.09]
[1,"Cracker Barrel",25,0.08]
{"$rows_left_out":76}
{"sheet":"Individual Order Form","index":2,"n_rows":56,"n_cols":14,"rows_kept":56,"cut":false,"hidden":false,"merged":[[53,6,54,9],[53,10,54,11],[42,6,42,7],[55,6,56,9],[55,10,56,11]]}
[null,"Retailer","Card Amt.","Profit %","Quantity","Cost",null,"Retailer","Card Amt.","Profit %","Quanity","Cost"]
[{"$f":"IF(+'Card List'!$A2=\"\",\"\",+'Card List'!$A2)","v":1},{"$f":"+'Card List'!$B2","v":"Amazon"},{"$f":"+'Card List'!$C2","v":25},{"$f":"'Card List'!$D2","v":2.2499999999999999E-2},null,null,{"$f":"+'Card List'!$A55","v":0},{"$f":"+'Card List'!$B55","v":"Old Navy"},{"$f":"+'Card List'!$C55","v":25},{"$f":"+IF(RIGHT('Card List'!$D55,2)=0,LEFT('Card List'!$D55,2),'Card List'!$D55)","v":0.14000000000000001},null,null,null,{"$f":"+IF(RIGHT('Card List'!D2,2)=0,LEFT('Card List'!D2,2),'Card List'!D2)","v":2.2499999999999999E-2}]
[{"$f":"IF(+'Card List'!$A3=\"\",\"\",+'Card List'!$A3)","v":""},{"$f":"+'Card List'!$B3","v":0},{"$f":"+'Card List'!$C3","v":0},{"$f":"'Card List'!$D3","v":0},null,null,{"$f":"+'Card List'!$A56","v":1},{"$f":"+'Card List'!$B56","v":"Olive Garden"},{"$f":"+'Card List'!$C56","v":25},{"$f":"+IF(RIGHT('Card List'!$D56,2)=0,LEFT('Card List'!$D56,2),'Card List'!$D56)","v":0.08},null,null,null,{"$f":"+IF(RIGHT('Card List'!D4,2)=0,LEFT('Card List'!D4,2),'Card List'!D4)","v":0.1}]
[{"$f":"IF(+'Card List'!$A4=\"\",\"\",+'Card List'!$A4)","v":0},{"$f":"+'Card List'!$B4","v":"American Eagle"},{"$f":"+'Card List'!$C4","v":25},{"$f":"'Card List'!$D4","v":0.1},null,null,{"$f":"+'Card List'!$A57","v":1},{"$f":"+'Card List'!$B57","v":"Panda Express"},{"$f":"+'Card List'!$C57","v":25},{"$f":"+IF(RIGHT('Card List'!$D57,2)=0,LEFT('Card List'!$D57,2),'Card List'!$D57)","v":0.08}]
[{"$f":"IF(+'Card List'!$A5=\"\",\"\",+'Card List'!$A5)","v":0},{"$f":"+'Card List'!$B5","v":"Apple iTunes"},{"$f":"+'Card List'!$C5","v":15},{"$f":"'Card List'!$D5","v":0.05},null,null,{"$f":"+'Card List'!$A58","v":1},{"$f":"+'Card List'!$B58","v":"Panera Bread"},{"$f":"+'Card List'!$C58","v":10},{"$f":"+IF(RIGHT('Card List'!$D58,2)=0,LEFT('Card List'!$D58,2),'Card List'!$D58)","v":0.08}]
[{"$f":"IF(+'Card List'!$A6=\"\",\"\",+'Card List'!$A6)","v":0},{"$f":"+'Card List'!$B6","v":"Applebee's"},{"$f":"+'Card List'!$C6","v":25},{"$f":"'Card List'!$D6","v":0.08},null,null,{"$f":"+'Card List'!$A59","v":1},{"$f":"+'Card List'!$B59","v":"Panera Bread"},{"$f":"+'Card List'!$C59","v":25},{"$f":"+IF(RIGHT('Card List'!$D59,2)=0,LEFT('Card List'!$D59,2),'Card List'!$D59)","v":0.08},null,null,null,{"$f":"IF(N2=0.0225,P2,CELL(\"format\",N2)=p0)","v":0}]
[{"$f":"IF(+'Card List'!$A7=\"\",\"\",+'Card List'!$A7)","v":1},{"$f":"+'Card List'!$B7","v":"Arby's"},{"$f":"+'Card List'!$C7","v":10},{"$f":"'Card List'!$D7","v":0.08},null,null,{"$f":"+'Card List'!$A60","v":0},{"$f":"+'Card List'!$B60","v":"Papa John's"},{"$f":"+'Card List'!$C60","v":10},{"$f":"+IF(RIGHT('Card List'!$D60,2)=0,LEFT('Card List'!$D60,2),'Card List'!$D60)","v":0.08}]
[{"$f":"IF(+'Card List'!$A8=\"\",\"\",+'Card List'!$A8)","v":1},{"$f":"+'Card List'!$B8","v":"Barnes & Noble"},{"$f":"+'Card List'!$C8","v":10},{"$f":"'Card List'!$D8","v":0.08},null,null,{"$f":"+'Card List'!$A61","v":0},{"$f":"+'Card List'!$B61","v":"Papa Murphy's"},{"$f":"+'Card List'!$C61","v":10},{"$f":"+IF(RIGHT('Card List'!$D61,2)=0,LEFT('Card List'!$D61,2),'Card List'!$D61)","v":0.08}]
[{"$f":"IF(+'Card List'!$A9=\"\",\"\",+'Card List'!$A9)","v":1},{"$f":"+'Card List'!$B9","v":"Bath & Body Works"},{"$f":"+'Card List'!$C9","v":10},{"$f":"'Card List'!$D9","v":0.13},null,null,{"$f":"+'Card List'!$A62","v":1},{"$f":"+'Card List'!$B62","v":"Piggly Wiggly"},{"$f":"+'Card List'!$C62","v":25},{"$f":"+IF(RIGHT('Card List'!$D62,2)=0,LEFT('Card List'!$D62,2),'Card List'!$D62)","v":0.03}]
[{"$f":"IF(+'Card List'!$A10=\"\",\"\",+'Card List'!$A10)","v":0},{"$f":"+'Card List'!$B10","v":"Bed Bath & Beyond"},{"$f":"+'Card List'!$C10","v":25},{"$f":"'Card List'!$D10","v":7.0000000000000007E-2},null,null,{"$f":"+'Card List'!$A63","v":1},{"$f":"+'Card List'!$B63","v":"Piggly Wiggly"},{"$f":"+'Card List'!$C63","v":50},{"$f":"+IF(RIGHT('Card List'!$D63,2)=0,LEFT('Card List'!$D63,2),'Card List'!$D63)","v":0.03}]
[{"$f":"IF(+'Card List'!$A11=\"\",\"\",+'Card List'!$A11)","v":0},{"$f":"+'Card List'!$B11","v":"Best Buy"},{"$f":"+'Card List'!$C11","v":25},{"$f":"'Card List'!$D11","v":0.04},null,null,{"$f":"+'Card List'!$A64","v":1},{"$f":"+'Card List'!$B64","v":"Piggly Wiggly"},{"$f":"+'Card List'!$C64","v":100},{"$f":"+IF(RIGHT('Card List'!$D64,2)=0,LEFT('Card List'!$D64,2),'Card List'!$D64)","v":0.03}]
[{"$f":"IF(+'Card List'!$A12=\"\",\"\",+'Card List'!$A12)","v":1},{"$f":"+'Card List'!$B12","v":"BP Oil/Amoco"},{"$f":"+'Card List'!$C12","v":50},{"$f":"'Card List'!$D12","v":1.4999999999999999E-2},null,null,{"$f":"+'Card List'!$A65","v":0},{"$f":"+'Card List'!$B65","v":"Pizza Hut"},{"$f":"+'Card List'!$C65","v":10},{"$f":"+IF(RIGHT('Card List'!$D65,2)=0,LEFT('Card List'!$D65,2),'Card List'!$D65)","v":0.08}]
[{"$f":"IF(+'Card List'!$A13=\"\",\"\",+'Card List'!$A13)","v":0},{"$f":"+'Card List'!$B13","v":"Buffalo Wild Wings"},{"$f":"+'Card List'!$C13","v":25},{"$f":"'Card List'!$D13","v":0.08},null,null,{"$f":"+'Card List'!$A66","v":0},{"$f":"+'Card List'!$B66","v":"Potbelly"},{"$f":"+'Card List'!$C66","v":10},{"$f":"+IF(RIGHT('Card List'!$D66,2)=0,LEFT('Card List'!$D66,2),'Card List'!$D66)","v":0.08}]
[{"$f":"IF(+'Card List'!$A14=\"\",\"\",+'Card List'!$A14)","v":0},{"$f":"+'Card List'!$B14","v":"Burger King"},{"$f":"+'Card List'!$C14","v":10},{"$f":"'Card List'!$D14","v":0.04},null,null,{"$f":"+'Card List'!$A67","v":0},{"$f":"+'Card List'!$B67","v":"Qdoba"},{"$f":"+'Card List'!$C67","v":25},{"$f":"+IF(RIGHT('Card List'!$D67,2)=0,LEFT('Card List'!$D67,2),'Card List'!$D67)","v":7.0000000000000007E-2}]
[{"$f":"IF(+'Card List'!$A15=\"\",\"\",+'Card List'!$A15)","v":0},{"$f":"+'Card List'!$B15","v":"Cheddars"},{"$f":"+'Card List'!$C15","v":25},{"$f":"'Card List'!$D15","v":0.08},null,null,{"$f":"+'Card List'!$A68","v":0},{"$f":"+'Card List'!$B68","v":"Red Lobster"},{"$f":"+'Card List'!$C68","v":25},{"$f":"+IF(RIGHT('Card List'!$D68,2)=0,LEFT('Card List'!$D68,2),'Card List'!$D68)","v":0.08}]
[{"$f":"IF(+'Card List'!$A16=\"\",\"\",+'Card List'!$A16)","v":0},{"$f":"+'Card List'!$B16","v":"Cheesecake Factory"},{"$f":"+'Card List'!$C16","v":25},{"$f":"'Card List'!$D16","v":0.05},null,null,{"$f":"+'Card List'!$A69","v":0},{"$f":"+'Card List'!$B69","v":"Red Robin"},{"$f":"+'Card List'!$C69","v":25},{"$f":"+IF(RIGHT('Card List'!$D69,2)=0,LEFT('Card List'!$D69,2),'Card List'!$D69)","v":0.08}]
[{"$f":"IF(+'Card List'!$A17=\"\",\"\",+'Card List'!$A17)","v":0},{"$f":"+'Card List'!$B17","v":"Chili's/Maggiano's"},{"$f":"+'Card List'!$C17","v":25},{"$f":"'Card List'!$D17","v":0.11},null,null,{"$f":"+'Card List'!$A70","v":1},{"$f":"+'Card List'!$B70","v":"Roundy's"},{"$f":"+'Card List'!$C70","v":25},{"$f":"+IF(RIGHT('Card List'!$D70,2)=0,LEFT('Card List'!$D70,2),'Card List'!$D70)","v":0.04}]
[{"$f":"IF(+'Card List'!$A18=\"\",\"\",+'Card List'!$A18)","v":1},{"$f":"+'Card List'!$B18","v":"Chipotle"},{"$f":"+'Card List'!$C18","v":10},{"$f":"'Card List'!$D18","v":0.1},null,null,{"$f":"+'Card List'!$A71","v":1},{"$f":"+'Card List'!$B71","v":"Roundy's"},{"$f":"+'Card List'!$C71","v":50},{"$f":"+IF(RIGHT('Card List'!$D71,2)=0,LEFT('Card List'!$D71,2),'Card List'!$D71)","v":0.04}]
[{"$f":"IF(+'Card List'!$A19=\"\",\"\",+'Card List'!$A19)","v":1},{"$f":"+'Card List'!$B19","v":"Cousin's"},{"$f":"+'Card List'!$C19","v":10},{"$f":"'Card List'!$D19","v":0.09},null,null,{"$f":"+'Card List'!$A72","v":1},{"$f":"+'Card List'!$B72","v":"Roundy's"},{"$f":"+'Card List'!$C72","v":100},{"$f":"+IF(RIGHT('Card List'!$D72,2)=0,LEFT('Card List'!$D72,2),'Card List'!$D72)","v":0.04}]
[{"$f":"IF(+'Card List'!$A20=\"\",\"\",+'Card List'!$A20)","v":1},{"$f":"+'Card List'!$B20","v":"Cracker Barrel"},{"$f":"+'Card List'!$C20","v":25},{"$f":"'Card List'!$D20","v":0.08},null,null,{"$f":"+'Card List'!$A73","v":0},{"$f":"+'Card List'!$B73","v":"Shell "},{"$f":"+'Card List'!$C73","v":25},{"$f":"+IF(RIGHT('Card List'!$D73,2)=0,LEFT('Card List'!$D73,2),'Card List'!$D73)","v":1.4999999999999999E-2}]
{"$rows_left_out":37}
{"sheet":"Monthly Sales","index":3,"n_rows":117,"n_cols":14,"rows_kept":117,"cut":false,"hidden":false,"merged":[[101,0,101,1],[0,0,1,13],[68,0,68,2],[76,0,77,0],[76,1,77,1],[2,12,2,13],[2,10,2,11],[65,0,65,1],[55,0,55,1],[63,0,63,1],[2,1,3,1],[2,0,3,0],[2,2,2,3],[2,4,2,5],[2,6,2,7],[2,8,2,9],[76,2,76,3],[76,4,76,5],[76,6,76,7],[76,8,76,9],[76,10,76,11],[104,10,104,11],[103,0,103,6],[104,0,105,0],[104,1,105,1],[104,2,104,3],[104,4,104,5],[104,6,104,7],[70,11,70,12],[115,12,115,13],[116,12,116,13],[109,12,109,13],[110,12,110,13],[111,12,111,13],[112,12,112,13],[113,12,113,13],[104,12,105,13],[106,12,106,13],[107,12,107,13],[108,12,108,13],[114,12,114,13],[76,12,76,13],[72,0,73,13],[104,8,104,9],[70,0,70,2],[70,3,70,4],[70,5,70,6],[70,7,70,8],[70,9,70,10],[67,11,67,12],[68,5,68,6],[69,5,69,6],[68,7,68,8],[69,7,69,8],[68,9,68,10],[69,9,69,10],[68,11,68,12],[69,11,69,12],[67,9,67,10],[68,3,68,4],[69,3,69,4],[67,3,67,4],[67,5,67,6],[67,7,67,8]]}
["LCR Scrip Sales for the Month and Year of:   ________________________"]
[]
["Retailer\n(Cards in Stock)","Card Amount","Date:    ",null,"Date:    ",null,"Date:    ",null,"Date:    ",null,"Date:    ",null,"Total Month Sales"]
[null,null,"# Cards","$","# Cards","$","# Cards","$","# Cards","$","# Cards","$","# Cards","$"]
[{"$f":"+'Individual Order Form'!B2","v":"Amazon"},{"$f":"+'Individual Order Form'!C2","v":25},null,{"$f":"IF(C5=\"\",0,+$B5*C5)","v":0},null,{"$f":"IF(E5=\"\",0,+$B5*E5)","v":0},null,{"$f":"IF(G5=\"\",0,+$B5*G5)","v":0},null,{"$f":"IF(I5=\"\",0,+$B5*I5)","v":0},null,{"$f":"IF(K5=\"\",0,+$B5*K5)","v":0},{"$f":"+C5+E5+G5+I5+K5","v":0},{"$f":"+D5+F5+H5+J5+L5","v":0}]
[{"$f":"+'Individual Order Form'!B5","v":"Apple iTunes"},{"$f":"+'Individual Order Form'!C5","v":15},null,{"$f":"IF(C6=\"\",0,+$B6*C6)","v":0},null,{"$f":"IF(E6=\"\",0,+$B6*E6)","v":0},null,{"$f":"IF(G6=\"\",0,+$B6*G6)","v":0},null,{"$f":"IF(I6=\"\",0,+$B6*I6)","v":0},null,{"$f":"IF(K6=\"\",0,+$B6*K6)","v":0},{"$f":"+C6+E6+G6+I6+K6","v":0},{"$f":"+D6+F6+H6+J6+L6","v":0}]
[{"$f":"+'Individual Order Form'!B6","v":"Applebee's"},{"$f":"+'Individual Order Form'!C6","v":25},null,0,null,0,null,0,null,0,null,0,0,0]
[{"$f":"+'Individual Order Form'!B7","v":"Arby's"},{"$f":"+'Individual Order Form'!C7","v":10},null,0,null,0,null,0,null,0,null,0,0,0]
[{"$f":"+'Individual Order Form'!B8","v":"Barnes & Noble"},{"$f":"+'Individual Order Form'!C8","v":10},null,0,null,0,null,0,null,0,null,0,0,0]
[{"$f":"+'Individual Order Form'!B11","v":"Best Buy"},{"$f":"+'Individual Order Form'!C11","v":25},null,0,null,0,null,0,null,0,null,0,0,0]
[{"$f":"+'Individual Order Form'!B12","v":"BP Oil/Amoco"},{"$f":"+'Individual Order Form'!C12","v":50},null,0,null,0,null,0,null,0,null,0,0,0]
[{"$f":"+'Individual Order Form'!B14","v":"Burger King"},{"$f":"+'Individual Order Form'!C14","v":10},null,0,null,0,null,0,null,0,null,0,0,0]
[{"$f":"+'Individual Order Form'!B15","v":"Cheddars"},{"$f":"+'Individual Order Form'!C15","v":25},null,0,null,0,null,0,null,0,null,0,{"$f":"+C13+E13+G13+I13+K13","v":0},{"$f":"+D13+F13+H13+J13+L13","v":0}]
[{"$f":"+'Individual Order Form'!B18","v":"Chipotle"},{"$f":"+'Individual Order Form'!C18","v":10},null,0,null,0,null,0,null,0,null,0,0,0]
[{"$f":"+'Individual Order Form'!B19","v":"Cousin's"},{"$f":"+'Individual Order Form'!C19","v":10},null,0,null,0,null,0,null,0,null,0,0,0]
[{"$f":"+'Individual Order Form'!B20","v":"Cracker Barrel"},{"$f":"+'Individual Order Form'!C20","v":25},null,0,null,0,null,0,null,0,null,0,0,0]
[{"$f":"+'Individual Order Form'!B25","v":"Dunkin' "},{"$f":"+'Individual Order Form'!C25","v":10},null,0,null,0,null,0,null,0,null,0,0,0]
[{"$f":"+'Individual Order Form'!B26","v":"Exxon/Mobil"},{"$f":"+'Individual Order Form'!C26","v":50},null,0,null,0,null,0,null,0,null,0,0,0]
[{"$f":"+'Individual Order Form'!B27","v":"Festival Foods"},{"$f":"+'Individual Order Form'!C27","v":25},null,0,null,0,null,0,null,0,null,0,0,0]
[{"$f":"+'Individual Order Form'!B28","v":"Festival Foods"},{"$f":"+'Individual Order Form'!C28","v":50},null,0,null,0,null,0,null,0,null,0,0,0]
{"$rows_left_out":98}
{"sheet":"Monthly Orders","index":4,"n_rows":70,"n_cols":14,"rows_kept":70,"cut":false,"hidden":false,"merged":[[55,0,55,1],[64,0,64,1],[66,0,66,1],[0,0,1,13],[2,0,3,0],[2,1,3,1],[2,2,2,3],[2,4,2,5],[2,6,2,7],[2,8,2,9],[2,10,2,11],[2,12,2,13]]}
["LCR Scrip Purchases for the Month and Year of:   ________________________"]
[]
["Retailer\n(Cards on hand)","Card Amount","Date:    ",null,"Date:    ",null,"Date:    ",null,"Date:    ",null,"Date:    ",null,"Total Month Purchases"]
[null,null,"# Cards","$","# Cards","$","# Cards","$","# Cards","$","# Cards","$","# Cards","$"]
[{"$f":"+'Monthly Sales'!A5","v":"Amazon"},{"$f":"+'Monthly Sales'!B5","v":25},null,{"$f":"IF(C5=\"\",0,+$B5*C5)","v":0},null,{"$f":"IF(E5=\"\",0,+$B5*E5)","v":0},null,{"$f":"IF(G5=\"\",0,+$B5*G5)","v":0},null,{"$f":"IF(I5=\"\",0,+$B5*I5)","v":0},null,{"$f":"IF(K5=\"\",0,+$B5*K5)","v":0},{"$f":"+C5+E5+G5+I5+K5","v":0},{"$f":"+D5+F5+H5+J5+L5","v":0}]
[{"$f":"+'Monthly Sales'!A6","v":"Apple iTunes"},{"$f":"+'Monthly Sales'!B6","v":15},null,{"$f":"IF(C6=\"\",0,+$B6*C6)","v":0},null,{"$f":"IF(E6=\"\",0,+$B6*E6)","v":0},null,{"$f":"IF(G6=\"\",0,+$B6*G6)","v":0},null,{"$f":"IF(I6=\"\",0,+$B6*I6)","v":0},null,{"$f":"IF(K6=\"\",0,+$B6*K6)","v":0},{"$f":"+C6+E6+G6+I6+K6","v":0},0]
[{"$f":"+'Monthly Sales'!A7","v":"Applebee's"},{"$f":"+'Monthly Sales'!B7","v":25},null,0,null,0,null,0,null,0,null,0,0,0]
[{"$f":"+'Monthly Sales'!A8","v":"Arby's"},{"$f":"+'Monthly Sales'!B8","v":10},null,0,null,0,null,0,null,0,null,0,0,0]
[{"$f":"+'Monthly Sales'!A9","v":"Barnes & Noble"},{"$f":"+'Monthly Sales'!B9","v":10},null,0,null,0,null,0,null,0,null,0,0,0]
[{"$f":"+'Monthly Sales'!A10","v":"Best Buy"},{"$f":"+'Monthly Sales'!B10","v":25},null,0,null,0,null,0,null,0,null,0,0,0]
[{"$f":"+'Monthly Sales'!A11","v":"BP Oil/Amoco"},{"$f":"+'Monthly Sales'!B11","v":50},null,0,null,0,null,0,null,0,null,0,0,0]
[{"$f":"+'Monthly Sales'!A12","v":"Burger King"},{"$f":"+'Monthly Sales'!B12","v":10},null,0,null,0,null,0,null,0,null,0,0,0]
[{"$f":"+'Monthly Sales'!A13","v":"Cheddars"},{"$f":"+'Monthly Sales'!B13","v":25},null,0,null,0,null,0,null,0,null,0,{"$f":"+C13+E13+G13+I13+K13","v":0},{"$f":"+D13+F13+H13+J13+L13","v":0}]
[{"$f":"+'Monthly Sales'!A14","v":"Chipotle"},{"$f":"+'Monthly Sales'!B14","v":10},null,0,null,0,null,0,null,0,null,0,0,0]
[{"$f":"+'Monthly Sales'!A15","v":"Cousin's"},{"$f":"+'Monthly Sales'!B15","v":10},null,0,null,0,null,0,null,0,null,0,0,0]
[{"$f":"+'Monthly Sales'!A16","v":"Cracker Barrel"},{"$f":"+'Monthly Sales'!B16","v":25},null,0,null,0,null,0,null,0,null,0,0,0]
[{"$f":"+'Monthly Sales'!A17","v":"Dunkin' "},{"$f":"+'Monthly Sales'!B17","v":10},null,0,null,0,null,0,null,0,null,0,0,0]
[{"$f":"+'Monthly Sales'!A18","v":"Exxon/Mobil"},{"$f":"+'Monthly Sales'!B18","v":50},null,0,null,0,null,0,null,0,null,0,0,0]
[{"$f":"+'Monthly Sales'!A19","v":"Festival Foods"},{"$f":"+'Monthly Sales'!B19","v":25},null,0,null,0,null,0,null,0,null,0,0,0]
[{"$f":"+'Monthly Sales'!A20","v":"Festival Foods"},{"$f":"+'Monthly Sales'!B20","v":50},null,0,null,0,null,0,null,0,null,0,0,0]
{"$rows_left_out":51}
{"sheet":"Monthly Inventory","index":5,"n_rows":67,"n_cols":14,"rows_kept":67,"cut":false,"hidden":false,"merged":[[55,0,55,1],[64,0,64,1],[66,0,66,1],[0,0,1,13],[2,0,3,0],[2,1,3,1],[2,2,2,3],[2,4,2,5],[2,6,2,7],[2,8,2,9],[2,10,2,11],[2,12,2,13]]}
["LCR Scrip Purchases for the Month and Year of:   ________________________"]
[]
["Retailer\n(Cards on hand)","Card Amount","Beginning of Month Inventory",null,"Monthly Sales (of cards kep on hand)",null,"Monthly Orders (of cards kept on hand)",null,"Ending of Month Inventory",null,"Count Validation",null,"Differences"]
[null,null,"# Cards","$","# Cards","$","# Cards","$","# Cards","$","# Cards","$","# Cards","$"]
[{"$f":"+'Monthly Sales'!A5","v":"Amazon"},{"$f":"+'Monthly Sales'!B5","v":25},null,{"$f":"IF(C5=\"\",0,+$B5*C5)","v":0},{"$f":"+'Monthly Sales'!M5","v":0},{"$f":"IF(E5=\"\",0,+$B5*E5)","v":0},{"$f":"+'Monthly Orders'!M5","v":0},{"$f":"IF(G5=\"\",0,+$B5*G5)","v":0},{"$f":"+C5-E5+G5","v":0},{"$f":"IF(I5=\"\",0,+$B5*I5)","v":0},null,{"$f":"IF(K5=\"\",0,+$B5*K5)","v":0},{"$f":"+I5-K5","v":0},{"$f":"+J5-L5","v":0}]
[{"$f":"+'Monthly Sales'!A6","v":"Apple iTunes"},{"$f":"+'Monthly Sales'!B6","v":15},null,{"$f":"IF(C6=\"\",0,+$B6*C6)","v":0},{"$f":"+'Monthly Sales'!M6","v":0},{"$f":"IF(E6=\"\",0,+$B6*E6)","v":0},{"$f":"+'Monthly Orders'!M6","v":0},{"$f":"IF(G6=\"\",0,+$B6*G6)","v":0},{"$f":"+C6-E6+G6","v":0},{"$f":"IF(I6=\"\",0,+$B6*I6)","v":0},null,{"$f":"IF(K6=\"\",0,+$B6*K6)","v":0},{"$f":"+I6-K6","v":0},{"$f":"+J6-L6","v":0}]
[{"$f":"+'Monthly Sales'!A7","v":"Applebee's"},{"$f":"+'Monthly Sales'!B7","v":25},null,0,{"$f":"+'Monthly Sales'!M7","v":0},0,{"$f":"+'Monthly Orders'!M7","v":0},0,0,0,null,0,0,0]
[{"$f":"+'Monthly Sales'!A8","v":"Arby's"},{"$f":"+'Monthly Sales'!B8","v":10},null,0,{"$f":"+'Monthly Sales'!M8","v":0},0,{"$f":"+'Monthly Orders'!M8","v":0},0,0,0,null,0,0,0]
[{"$f":"+'Monthly Sales'!A9","v":"Barnes & Noble"},{"$f":"+'Monthly Sales'!B9","v":10},null,0,{"$f":"+'Monthly Sales'!M9","v":0},0,{"$f":"+'Monthly Orders'!M9","v":0},0,0,0,null,0,0,0]
[{"$f":"+'Monthly Sales'!A10","v":"Best Buy"},{"$f":"+'Monthly Sales'!B10","v":25},null,0,{"$f":"+'Monthly Sales'!M10","v":0},0,{"$f":"+'Monthly Orders'!M10","v":0},0,0,0,null,0,0,0]
[{"$f":"+'Monthly Sales'!A11","v":"BP Oil/Amoco"},{"$f":"+'Monthly Sales'!B11","v":50},null,0,{"$f":"+'Monthly Sales'!M11","v":0},0,{"$f":"+'Monthly Orders'!M11","v":0},0,0,0,null,0,0,0]
[{"$f":"+'Monthly Sales'!A12","v":"Burger King"},{"$f":"+'Monthly Sales'!B12","v":10},null,0,{"$f":"+'Monthly Sales'!M12","v":0},0,{"$f":"+'Monthly Orders'!M12","v":0},0,0,0,null,0,0,0]
[{"$f":"+'Monthly Sales'!A13","v":"Cheddars"},{"$f":"+'Monthly Sales'!B13","v":25},null,0,{"$f":"+'Monthly Sales'!M13","v":0},0,{"$f":"+'Monthly Orders'!M13","v":0},0,0,0,null,0,0,0]
[{"$f":"+'Monthly Sales'!A14","v":"Chipotle"},{"$f":"+'Monthly Sales'!B14","v":10},null,0,{"$f":"+'Monthly Sales'!M14","v":0},0,{"$f":"+'Monthly Orders'!M14","v":0},0,0,0,null,0,0,0]
[{"$f":"+'Monthly Sales'!A15","v":"Cousin's"},{"$f":"+'Monthly Sales'!B15","v":10},null,0,{"$f":"+'Monthly Sales'!M15","v":0},0,{"$f":"+'Monthly Orders'!M15","v":0},0,0,0,null,0,0,0]
[{"$f":"+'Monthly Sales'!A16","v":"Cracker Barrel"},{"$f":"+'Monthly Sales'!B16","v":25},null,0,{"$f":"+'Monthly Sales'!M16","v":0},0,{"$f":"+'Monthly Orders'!M16","v":0},0,0,0,null,0,0,0]
[{"$f":"+'Monthly Sales'!A17","v":"Dunkin' "},{"$f":"+'Monthly Sales'!B17","v":10},null,0,{"$f":"+'Monthly Sales'!M17","v":0},0,{"$f":"+'Monthly Orders'!M17","v":0},0,0,0,null,0,0,0]
[{"$f":"+'Monthly Sales'!A18","v":"Exxon/Mobil"},{"$f":"+'Monthly Sales'!B18","v":50},null,0,{"$f":"+'Monthly Sales'!M18","v":0},0,{"$f":"+'Monthly Orders'!M18","v":0},0,0,0,null,0,0,0]
[{"$f":"+'Monthly Sales'!A19","v":"Festival Foods"},{"$f":"+'Monthly Sales'!B19","v":25},null,0,{"$f":"+'Monthly Sales'!M19","v":0},0,{"$f":"+'Monthly Orders'!M19","v":0},0,0,0,null,0,0,0]
[{"$f":"+'Monthly Sales'!A20","v":"Festival Foods"},{"$f":"+'Monthly Sales'!B20","v":50},null,0,{"$f":"+'Monthly Sales'!M20","v":0},0,{"$f":"+'Monthly Orders'!M20","v":0},0,0,0,null,0,0,0]
{"$rows_left_out":48}
{"sheet":"Formulas","index":6,"n_rows":3,"n_cols":5,"rows_kept":3,"cut":false,"hidden":false,"merged":[]}
[null,"Individual Order Row formulas"]
[null,{"$f":"IF(+'Card List'!$A2=\"\",\"\",+'Card List'!$A2)","v":1},{"$f":"IF(+'Card List'!$B2=\"\",\"\",+'Card List'!$B2)","v":"Amazon"},{"$f":"IF(+'Card List'!$C2=\"\",\"\",+'Card List'!$C2)","v":25},{"$f":"IF('Card List'!$D2=\"\",\"\",'Card List'!$D2)","v":2.2499999999999999E-2}]
[null,{"$f":"IF(+'Card List'!$A56=\"\",\"\",+'Card List'!$A56)","v":1},{"$f":"IF(+'Card List'!$B56=\"\",\"\",+'Card List'!$B56)","v":"Olive Garden"},{"$f":"+'Card List'!$C56","v":25},{"$f":"'Card List'!$D56","v":0.08}]

{"sheet":"Sheet3","index":7,"n_rows":0,"n_cols":0,"rows_kept":0,"cut":false,"hidden":false,"merged":[]}